Reaction Details
TargetCathepsin D
LigandBDBM50271627
Substrate/Competitorn/a
Meas. Tech.ChEMBL_556482 (CHEMBL956477)
Ki 32±n/a nM
Citation Cumming, JNLe, TXBabu, SCarroll, CChen, XFavreau, LGaspari, PGuo, THobbs, DWHuang, YIserloh, UKennedy, MEKuvelkar, RLi, GLowrie, JMcHugh, NAOzgur, LPan, JParker, EMSaionz, KStamford, AWStrickland, CTadesse, DVoigt, JWang, LWu, YZhang, LZhang, Q Rational design of novel, potent piperazinone and imidazolidinone BACE1 inhibitors. Bioorg Med Chem Lett18:3236-41 (2008) 
 
Cathepsin D
Name:Cathepsin D
Type:Enzyme
Mol. Mass.:44551.72
Organism:Homo sapiens (Human)
Description:Human proCathepsin D (SwissProt accession number P07339) was expressed in Sf9 cells, purified, and autoactivated.
Residue:412
BDBM50271627
NameBDBM50271627
Synonyms:CHEMBL507651 N1-((1S,2S)-1-((S)-1-benzyl-5-oxoimidazolidin-4-yl)-3-(3,5-difluorophenyl)-1-hydroxypropan-2-yl)-5-methyl-N3,N3-dipropylisophthalamide
TypeSmall organic molecule
Emp. Form.C34H40F2N4O4
Mol. Mass.606.7026
SMILESCCCN(CCC)C(=O)c1cc(C)cc(c1)C(=O)N[C@@H](Cc1cc(F)cc(F)c1)[C@H](O)[C@@H]1NCN(Cc2ccccc2)C1=O