Reaction Details
TargetNitric oxide synthase, brain
LigandBDBM7886
Substrate/Competitorn/a
Meas. Tech.ChEMBL_552452 (CHEMBL1002712)
Ki 430000±n/a nM
Citation Castaño, TEncinas, APérez, CCastro, ACampillo, NEGil, C Design, synthesis, and evaluation of potential inhibitors of nitric oxide synthase. Bioorg Med Chem16:6193-206 (2008) 
 
Nitric oxide synthase, brain
Name:Nitric oxide synthase, brain
Type:Homodimer
Mol. Mass.:160985.98
Organism:Homo sapiens (Human)
Description:P29475
Residue:1434
BDBM7886
NameBDBM7886
Synonyms:1-PIM 1-phenylimidazole US9138393, 1-Phenyl- imidazole | US9144538, 1-Phenylimidazole
TypeSmall organic molecule
Emp. Form.C9H8N2
Mol. Mass.144.1732
SMILESc1cn(cn1)-c1ccccc1