Reaction Details
TargetNitric oxide synthase, brain
LigandBDBM50240895
Substrate/Competitorn/a
Meas. Tech.ChEMBL_552452 (CHEMBL1002712)
Ki 105000±n/a nM
Citation Castaño, TEncinas, APérez, CCastro, ACampillo, NEGil, C Design, synthesis, and evaluation of potential inhibitors of nitric oxide synthase. Bioorg Med Chem16:6193-206 (2008) 
 
Nitric oxide synthase, brain
Name:Nitric oxide synthase, brain
Type:Homodimer
Mol. Mass.:160985.98
Organism:Homo sapiens (Human)
Description:P29475
Residue:1434
BDBM50240895
NameBDBM50240895
Synonyms:2-(1H-Imidazol-1-yl)-1-(4-nitrophenyl)ethanone CHEMBL162549
TypeSmall organic molecule
Emp. Form.C11H9N3O3
Mol. Mass.231.2075
SMILES[O-][N+](=O)c1ccc(cc1)C(=O)Cn1ccnc1