Reaction Details
TargetNitric oxide synthase, brain
LigandBDBM50055281
Substrate/Competitorn/a
Meas. Tech.ChEMBL_552452 (CHEMBL1002712)
Ki 29±n/a nM
Citation Castaño, TEncinas, APérez, CCastro, ACampillo, NEGil, C Design, synthesis, and evaluation of potential inhibitors of nitric oxide synthase. Bioorg Med Chem16:6193-206 (2008) 
 
Nitric oxide synthase, brain
Name:Nitric oxide synthase, brain
Type:Homodimer
Mol. Mass.:160985.98
Organism:Homo sapiens (Human)
Description:P29475
Residue:1434
BDBM50055281
NameBDBM50055281
Synonyms:2-Ethyl-isothiourea ETHYLISOTHIOUREA S-ethyl-iso-thiourea
TypeSmall organic molecule
Emp. Form.C3H8N2S
Mol. Mass.104.174
SMILESCCSC(N)=N