Reaction Details
TargetPeroxisome proliferator-activated receptor gamma
LigandBDBM50049240
Substrate/Competitorn/a
Meas. Tech.ChEMBL_556513 (CHEMBL956508)
IC50 700±n/a nM
Citation Sundriyal, SViswanad, BBharathy, ERamarao, PChakraborti, AKBharatam, PV New PPARgamma ligands based on 2-hydroxy-1,4-naphthoquinone: computer-aided design, synthesis, and receptor-binding studies. Bioorg Med Chem Lett18:3192-5 (2008) 
 
Peroxisome proliferator-activated receptor gamma
Name:Peroxisome proliferator-activated receptor gamma
Type:PROTEIN
Mol. Mass.:57562.54
Organism:Rattus norvegicus
Description:ChEMBL_642067
Residue:505
BDBM50049240
NameBDBM50049240
Synonyms:(+-)-5-((4-(2-(5-ethyl-2-pyridinyl)ethoxy)phenyl)methyl)-2,4-thiazolidinedione CHEMBL595 PIOGLITAZONE HYDROCHLORIDE
TypeSmall organic molecule
Emp. Form.C19H20N2O3S
Mol. Mass.356.439
SMILESCCc1ccc(CCOc2ccc(Cc3sc(=O)[nH]c3O)cc2)nc1