Reaction Details
TargetMu-type opioid receptor
LigandBDBM50271441
Substrate/Competitorn/a
Meas. Tech.ChEMBL_556845 (CHEMBL964705)
IC50 64.41±n/a nM
Citation Wang, CLYao, JLYu, YShao, XCui, YLiu, HMLai, LHWang, R Structure-activity study of endomorphin-2 analogs with C-terminal modifications by NMR spectroscopy and molecular modeling. Bioorg Med Chem16:6415-22 (2008) 
 
Mu-type opioid receptor
Name:Mu-type opioid receptor
Synonyms:Mu-opioid receptor
Type:PROTEIN
Mol. Mass.:44729.40
Organism:Cavia porcellus
Description:ChEMBL_510437
Residue:400
BDBM50271441
NameBDBM50271441
TypeSmall organic molecule
Emp. Form.C34H40N4O6
Mol. Mass.600.7046
SMILESCCOC(=O)[C@H](Cc1ccccc1)NC(=O)[C@H](Cc1ccccc1)NC(=O)[C@@H]1CCCN1C(=O)[C@@H](N)Cc1ccc(O)cc1