Reaction Details
TargetKappa-type opioid receptor
LigandBDBM50267353
Substrate/Competitorn/a
Meas. Tech.ChEMBL_563920 (CHEMBL965828)
IC50>10000±n/a nM
Citation Bedürftig, SWünsch, B 1,4-Diazepanes derived from (S)-serine--homopiperazines with improved sigma(1) (sigma) receptor affinity and selectivity. Eur J Med Chem44:519-25 (2009) 
 
Kappa-type opioid receptor
Name:Kappa-type opioid receptor
Type:G Protein-Coupled Receptor (GPCR)
Mol. Mass.:42648.76
Organism:Homo sapiens (Human)
Description:P41145
Residue:380
BDBM50267353
NameBDBM50267353
Synonyms:(-)-[(2R)-1-Benzyl-4-(2,2-dimethoxyethyl)-1,4-diazepan-2-yl]methanol | CHEMBL518434
TypeSmall organic molecule
Emp. Form.C17H28N2O3
Mol. Mass.308.4158
SMILESCOC(CN1CCCN(Cc2ccccc2)[C@@H](CO)C1)OC