Reaction Details
TargetSodium channel protein type 10 subunit alpha
LigandBDBM50270681
Substrate/Competitorn/a
Meas. Tech.ChEMBL_552551 (CHEMBL953995)
IC50 14000±n/a nM
Citation Drizin, IGregg, RJScanio, MJShi, LGross, MFAtkinson, RNThomas, JBJohnson, MSCarroll, WAMarron, BEChapman, MLLiu, DKrambis, MJShieh, CCZhang, XHernandez, GGauvin, DMMikusa, JPZhu, CZJoshi, SHonore, PMarsh, KCRoeloffs, RWerness, SKrafte, DSJarvis, MFFaltynek, CRKort, ME Discovery of potent furan piperazine sodium channel blockers for treatment of neuropathic pain. Bioorg Med Chem16:6379-86 (2008) 
 
Sodium channel protein type 10 subunit alpha
Name:Sodium channel protein type 10 subunit alpha
Type:PROTEIN
Mol. Mass.:220545.77
Organism:Mus musculus
Description:ChEMBL_675096
Residue:1958
BDBM50270681
NameBDBM50270681
Synonyms:CHEMBL487307 | [5-(4-Chlorophenyl)-furan-2-yl]-[4-(3-trifluoromethylphenyl)-piperazin-1-yl]-methanone
TypeSmall organic molecule
Emp. Form.C22H18ClF3N2O2
Mol. Mass.434.839
SMILESFC(F)(F)c1cccc(c1)N1CCN(CC1)C(=O)c1ccc(o1)-c1ccc(Cl)cc1