Reaction Details
TargetSodium channel protein type 10 subunit alpha
LigandBDBM50270649
Substrate/Competitorn/a
Meas. Tech.ChEMBL_552563 (CHEMBL954007)
IC50 280±n/a nM
Citation Drizin, IGregg, RJScanio, MJShi, LGross, MFAtkinson, RNThomas, JBJohnson, MSCarroll, WAMarron, BEChapman, MLLiu, DKrambis, MJShieh, CCZhang, XHernandez, GGauvin, DMMikusa, JPZhu, CZJoshi, SHonore, PMarsh, KCRoeloffs, RWerness, SKrafte, DSJarvis, MFFaltynek, CRKort, ME Discovery of potent furan piperazine sodium channel blockers for treatment of neuropathic pain. Bioorg Med Chem16:6379-86 (2008) 
 
Sodium channel protein type 10 subunit alpha
Name:Sodium channel protein type 10 subunit alpha
Type:Enzyme
Mol. Mass.:220609.21
Organism:Homo sapiens (Human)
Description:Q9Y5Y9
Residue:1956
BDBM50270649
NameBDBM50270649
Synonyms:1-[5-(4-Chlorophenyl)-2-furoyl]piperazine | CHEMBL521211
TypeSmall organic molecule
Emp. Form.C15H15ClN2O2
Mol. Mass.290.745
SMILESClc1ccc(cc1)-c1ccc(o1)C(=O)N1CCNCC1