Reaction Details
TargetSodium channel protein type 10 subunit alpha
LigandBDBM50031299
Substrate/Competitorn/a
Meas. Tech.ChEMBL_552563 (CHEMBL954007)
IC50 96000±n/a nM
Citation Drizin, IGregg, RJScanio, MJShi, LGross, MFAtkinson, RNThomas, JBJohnson, MSCarroll, WAMarron, BEChapman, MLLiu, DKrambis, MJShieh, CCZhang, XHernandez, GGauvin, DMMikusa, JPZhu, CZJoshi, SHonore, PMarsh, KCRoeloffs, RWerness, SKrafte, DSJarvis, MFFaltynek, CRKort, ME Discovery of potent furan piperazine sodium channel blockers for treatment of neuropathic pain. Bioorg Med Chem16:6379-86 (2008) 
 
Sodium channel protein type 10 subunit alpha
Name:Sodium channel protein type 10 subunit alpha
Type:Enzyme
Mol. Mass.:220609.21
Organism:Homo sapiens (Human)
Description:Q9Y5Y9
Residue:1956
BDBM50031299
NameBDBM50031299
Synonyms:6-(2,3-Dichloro-phenyl)-[1,2,4]triazine-3,5-diamine 6-(2,3-dichlorophenyl)-1,2,4-triazine-3,5-diamine CHEMBL741 Lamictal | Lamictal cd
TypeSmall organic molecule
Emp. Form.C9H7Cl2N5
Mol. Mass.256.091
SMILESNc1nnc(c(N)n1)-c1cccc(Cl)c1Cl