Reaction Details
TargetSodium channel protein type 10 subunit alpha
LigandBDBM50270707
Substrate/Competitorn/a
Meas. Tech.ChEMBL_552563 (CHEMBL954007)
IC50 30±n/a nM
Citation Drizin, IGregg, RJScanio, MJShi, LGross, MFAtkinson, RNThomas, JBJohnson, MSCarroll, WAMarron, BEChapman, MLLiu, DKrambis, MJShieh, CCZhang, XHernandez, GGauvin, DMMikusa, JPZhu, CZJoshi, SHonore, PMarsh, KCRoeloffs, RWerness, SKrafte, DSJarvis, MFFaltynek, CRKort, ME Discovery of potent furan piperazine sodium channel blockers for treatment of neuropathic pain. Bioorg Med Chem16:6379-86 (2008) 
 
Sodium channel protein type 10 subunit alpha
Name:Sodium channel protein type 10 subunit alpha
Type:Enzyme
Mol. Mass.:220609.21
Organism:Homo sapiens (Human)
Description:Q9Y5Y9
Residue:1956
BDBM50270707
NameBDBM50270707
Synonyms:CHEMBL486495 | [5-(4-tert-Butylphenyl)furan-2-yl]-(4-cyclohexylpiperazin-1-yl)-methanone
TypeSmall organic molecule
Emp. Form.C25H34N2O2
Mol. Mass.394.5497
SMILESCC(C)(C)c1ccc(cc1)-c1ccc(o1)C(=O)N1CCN(CC1)C1CCCCC1