Reaction Details
TargetNitric oxide synthase, brain
LigandBDBM50271277
Substrate/Competitorn/a
Meas. Tech.ChEMBL_552617 (CHEMBL957261)
IC50 25000±n/a nM
Citation Cottyn, BAcher, FRamassamy, BAlvey, LLepoivre, MFrapart, YStuehr, DMansuy, DBoucher, JLVichard, D Inhibitory effects of a series of 7-substituted-indazoles toward nitric oxide synthases: particular potency of 1H-indazole-7-carbonitrile. Bioorg Med Chem16:5962-73 (2008) 
 
Nitric oxide synthase, brain
Name:Nitric oxide synthase, brain
Type:Enzyme
Mol. Mass.:160570.98
Organism:Rattus norvegicus (rat)
Description:Recombinant nNOS overexpressed in E. coli was used in enzyme assays.
Residue:1429
BDBM50271277
NameBDBM50271277
Synonyms:1H-Indazole-7-carbonitrile | CHEMBL484298
TypeSmall organic molecule
Emp. Form.C8H5N3
Mol. Mass.143.1454
SMILESN#Cc1cccc2cn[nH]c12