Reaction Details
TargetNitric oxide synthase, inducible
LigandBDBM50271275
Substrate/Competitorn/a
Meas. Tech.ChEMBL_552618 (CHEMBL957262)
IC50 110000±n/a nM
Citation Cottyn, BAcher, FRamassamy, BAlvey, LLepoivre, MFrapart, YStuehr, DMansuy, DBoucher, JLVichard, D Inhibitory effects of a series of 7-substituted-indazoles toward nitric oxide synthases: particular potency of 1H-indazole-7-carbonitrile. Bioorg Med Chem16:5962-73 (2008) 
 
Nitric oxide synthase, inducible
Name:Nitric oxide synthase, inducible
Type:Enzyme
Mol. Mass.:130595.79
Organism:Mus musculus (mouse)
Description:Recombinant enzyme overexpressed in E. coli.
Residue:1144
BDBM50271275
NameBDBM50271275
Synonyms:1H-Indazol-7-amine CHEMBL463676
TypeSmall organic molecule
Emp. Form.C7H7N3
Mol. Mass.133.1506
SMILESNc1cccc2cn[nH]c12