Reaction Details
TargetNitric oxide synthase, endothelial
LigandBDBM50270526
Substrate/Competitorn/a
Meas. Tech.ChEMBL_552620 (CHEMBL957264)
IC50 225000±n/a nM
Citation Cottyn, BAcher, FRamassamy, BAlvey, LLepoivre, MFrapart, YStuehr, DMansuy, DBoucher, JLVichard, D Inhibitory effects of a series of 7-substituted-indazoles toward nitric oxide synthases: particular potency of 1H-indazole-7-carbonitrile. Bioorg Med Chem16:5962-73 (2008) 
 
Nitric oxide synthase, endothelial
Name:Nitric oxide synthase, endothelial
Type:Enzyme
Mol. Mass.:133292.26
Organism:Bos taurus (bovine)
Description:Recombinant eNOS overexpressed in E. coli was used in enzyme assays.
Residue:1205
BDBM50270526
NameBDBM50270526
Synonyms:7-Ethynyl-1H-indazole | CHEMBL452956
TypeSmall organic molecule
Emp. Form.C9H6N2
Mol. Mass.142.1573
SMILESC#Cc1cccc2cn[nH]c12