Reaction Details
Target5-hydroxytryptamine receptor 1B
LigandBDBM50070409
Substrate/Competitorn/a
Meas. Tech.ChEMBL_552731 (CHEMBL965237)
Ki 0.760000±n/a nM
Citation Choi, SKGreen, DHo, AKlein, UMarquess, DTaylor, RTurner, SD Designing selective, high affinity ligands of 5-HT1D receptor by covalent dimerization of 5-HT1F ligands derived from 4-fluoro-N-[3-(1-methyl-4-piperidinyl)-1H-indol-5-yl]benzamide. J Med Chem51:3609-16 (2008) 
 
5-hydroxytryptamine receptor 1B
Name:5-hydroxytryptamine receptor 1B
Type:G Protein-Coupled Receptor (GPCR)
Mol. Mass.:43579.17
Organism:Homo sapiens (Human)
Description:Receptor binding assays were performed using human clone stably expressed in CHO cells
Residue:390
BDBM50070409
NameBDBM50070409
Synonyms:2-(5-(2-(8-(4-methylpiperazin-1-yl)naphthalen-2-yloxy)ethoxy)-1H-indol-3-yl)ethanamine CHEMBL31217
TypeSmall organic molecule
Emp. Form.C27H32N4O2
Mol. Mass.444.5686
SMILESCN1CCN(CC1)c1cccc2ccc(OCCOc3ccc4[nH]cc(CCN)c4c3)cc12