Reaction Details
Target5-hydroxytryptamine receptor 1B
LigandBDBM50069315
Substrate/Competitorn/a
Meas. Tech.ChEMBL_552731 (CHEMBL965237)
Ki 0.640000±n/a nM
Citation Choi, SKGreen, DHo, AKlein, UMarquess, DTaylor, RTurner, SD Designing selective, high affinity ligands of 5-HT1D receptor by covalent dimerization of 5-HT1F ligands derived from 4-fluoro-N-[3-(1-methyl-4-piperidinyl)-1H-indol-5-yl]benzamide. J Med Chem51:3609-16 (2008) 
 
5-hydroxytryptamine receptor 1B
Name:5-hydroxytryptamine receptor 1B
Type:G Protein-Coupled Receptor (GPCR)
Mol. Mass.:43579.17
Organism:Homo sapiens (Human)
Description:Receptor binding assays were performed using human clone stably expressed in CHO cells
Residue:390
BDBM50069315
NameBDBM50069315
Synonyms:C-[3-(2-Dimethylamino-ethyl)-1H-indol-5-yl]-N-[4-({[3-(2-dimethylamino-ethyl)-1H-indol-5-ylmethanesulfonyl]-methyl-amino}-methyl)-benzyl]-N-methyl-methanesulfonamide | CHEMBL158941
TypeSmall organic molecule
Emp. Form.C36H48N6O4S2
Mol. Mass.692.934
SMILESCN(C)CCc1c[nH]c2ccc(CS(=O)(=O)N(C)Cc3ccc(CN(C)S(=O)(=O)Cc4ccc5[nH]cc(CCN(C)C)c5c4)cc3)cc12