Reaction Details
Target5-hydroxytryptamine receptor 1B
LigandBDBM50271128
Substrate/Competitorn/a
Meas. Tech.ChEMBL_552731 (CHEMBL965237)
Ki 1.3±n/a nM
Citation Choi, SKGreen, DHo, AKlein, UMarquess, DTaylor, RTurner, SD Designing selective, high affinity ligands of 5-HT1D receptor by covalent dimerization of 5-HT1F ligands derived from 4-fluoro-N-[3-(1-methyl-4-piperidinyl)-1H-indol-5-yl]benzamide. J Med Chem51:3609-16 (2008) 
 
5-hydroxytryptamine receptor 1B
Name:5-hydroxytryptamine receptor 1B
Type:G Protein-Coupled Receptor (GPCR)
Mol. Mass.:43579.17
Organism:Homo sapiens (Human)
Description:Receptor binding assays were performed using human clone stably expressed in CHO cells
Residue:390
BDBM50271128
NameBDBM50271128
Synonyms:CHEMBL448902 | N1,N8-bis(3-(1-methylpiperidin-4-yl)-1H-indol-5-yl)octanediamide
TypeSmall organic molecule
Emp. Form.C36H48N6O2
Mol. Mass.596.8053
SMILESCN1CCC(CC1)c1c[nH]c2ccc(NC(=O)CCCCCCC(=O)Nc3ccc4[nH]cc(C5CCN(C)CC5)c4c3)cc12