Reaction Details
TargetCannabinoid receptor 1
LigandBDBM50266809
Substrate/Competitorn/a
Meas. Tech.ChEMBL_564086 (CHEMBL963331)
Ki 14±n/a nM
Citation Fan, HKotsikorou, EHoffman, AFRavert, HTHolt, DHurst, DPLupica, CRReggio, PHDannals, RFHorti, AG Analogs of JHU75528, a PET ligand for imaging of cerebral cannabinoid receptors (CB1): development of ligands with optimized lipophilicity and binding affinity. Eur J Med Chem44:593-608 (2009) 
 
Cannabinoid receptor 1
Name:Cannabinoid receptor 1
Type:G Protein-Coupled Receptor (GPCR)
Mol. Mass.:52868.96
Organism:Homo sapiens (Human)
Description:P21554
Residue:472
BDBM50266809
NameBDBM50266809
Synonyms:1-(2,4-Dichlorophenyl)-4-cyano-5-(4-bromophenyl)-N-(piperidin-1-yl)-1H-pyrazole-3-carboxamide | CHEMBL475977
TypeSmall organic molecule
Emp. Form.C22H18BrCl2N5O
Mol. Mass.519.221
SMILESClc1ccc(c(Cl)c1)-n1nc(C(=O)NN2CCCCC2)c(C#N)c1-c1ccc(Br)cc1