Reaction Details
TargetCannabinoid receptor 1
LigandBDBM50266864
Substrate/Competitorn/a
Meas. Tech.ChEMBL_564086 (CHEMBL963331)
Ki 24±n/a nM
Citation Fan, HKotsikorou, EHoffman, AFRavert, HTHolt, DHurst, DPLupica, CRReggio, PHDannals, RFHorti, AG Analogs of JHU75528, a PET ligand for imaging of cerebral cannabinoid receptors (CB1): development of ligands with optimized lipophilicity and binding affinity. Eur J Med Chem44:593-608 (2009) 
 
Cannabinoid receptor 1
Name:Cannabinoid receptor 1
Type:G Protein-Coupled Receptor (GPCR)
Mol. Mass.:52868.96
Organism:Homo sapiens (Human)
Description:P21554
Residue:472
BDBM50266864
NameBDBM50266864
Synonyms:5-(4-chlorophenyl)-4-cyano-1-(2,4-dichlorophenyl)-N-(piperidin-1-yl)-1H-pyrazole-3-carboxamide | CHEMBL477642
TypeSmall organic molecule
Emp. Form.C22H18Cl3N5O
Mol. Mass.474.77
SMILESClc1ccc(cc1)-c1c(C#N)c(nn1-c1ccc(Cl)cc1Cl)C(=O)NN1CCCCC1