Reaction Details
TargetGonadotropin-releasing hormone receptor
LigandBDBM50244211
Substrate/Competitorn/a
Meas. Tech.ChEMBL_554180 (CHEMBL963637)
IC50 4.9±n/a nM
Citation Pelletier, JCChengalvala, MCottom, JFeingold, IGarrick, LGreen, DHauze, DHuselton, CJetter, JKao, WKopf, GSLundquist, JTMann, CMehlmann, JRogers, JShanno, LWrobel, J 2-phenyl-4-piperazinylbenzimidazoles: orally active inhibitors of the gonadotropin releasing hormone (GnRH) receptor. Bioorg Med Chem16:6617-40 (2008) 
 
Gonadotropin-releasing hormone receptor
Name:Gonadotropin-releasing hormone receptor
Type:Enzyme
Mol. Mass.:37749.45
Organism:Homo sapiens (Human)
Description:P30968
Residue:328
BDBM50244211
NameBDBM50244211
Synonyms:6-((4-(2-(4-tert-butylphenyl)-1H-benzo[d]imidazol-4-yl)piperazin-1-yl)methyl)quinoxaline-2,3(1H,4H)-dione CHEMBL459215
TypeSmall organic molecule
Emp. Form.C30H32N6O2
Mol. Mass.508.6141
SMILESCC(C)(C)c1ccc(cc1)-c1nc2c(cccc2[nH]1)N1CCN(Cc2ccc3[nH]c(=O)c(=O)[nH]c3c2)CC1