Reaction Details
TargetGonadotropin-releasing hormone receptor
LigandBDBM50244212
Substrate/Competitorn/a
Meas. Tech.ChEMBL_554182 (CHEMBL963639)
IC50 32±n/a nM
Citation Pelletier, JCChengalvala, MCottom, JFeingold, IGarrick, LGreen, DHauze, DHuselton, CJetter, JKao, WKopf, GSLundquist, JTMann, CMehlmann, JRogers, JShanno, LWrobel, J 2-phenyl-4-piperazinylbenzimidazoles: orally active inhibitors of the gonadotropin releasing hormone (GnRH) receptor. Bioorg Med Chem16:6617-40 (2008) 
 
Gonadotropin-releasing hormone receptor
Name:Gonadotropin-releasing hormone receptor
Type:PROTEIN
Mol. Mass.:37767.60
Organism:Rattus norvegicus
Description:ChEMBL_1335047
Residue:327
BDBM50244212
NameBDBM50244212
Synonyms:5-((4-(2-(4-tert-Butylphenyl)-1H-benzo[d]imidazol-4-yl)piperazin-1-yl)methyl)pyrimidine-2,4(1H,3H)-dione | CHEMBL516479
TypeSmall organic molecule
Emp. Form.C26H30N6O2
Mol. Mass.458.5554
SMILESCC(C)(C)c1ccc(cc1)-c1nc2c(cccc2[nH]1)N1CCN(Cc2c[nH]c(=O)[nH]c2=O)CC1