Reaction Details
TargetCannabinoid receptor 2
LigandBDBM50270540
Substrate/Competitorn/a
Meas. Tech.ChEMBL_552828 (CHEMBL957299)
Ki 492±n/a nM
Citation Zhang, YBurgess, JPBrackeen, MGilliam, AMascarella, SWPage, KSeltzman, HHThomas, BF Conformationally constrained analogues of N-(piperidinyl)-5-(4-chlorophenyl)-1-(2,4- dichlorophenyl)-4-methyl-1H-pyrazole-3-carboxamide (SR141716): design, synthesis, computational analysis, and biological evaluations. J Med Chem51:3526-39 (2008) 
 
Cannabinoid receptor 2
Name:Cannabinoid receptor 2
Type:G Protein-Coupled Receptor (GPCR)
Mol. Mass.:39690.94
Organism:Homo sapiens (Human)
Description:P34972
Residue:360
BDBM50270540
NameBDBM50270540
Synonyms:9-Chloro-1-(2,4-dichlorophenyl)-N-piperidin-1-yl-4,5,6,7-tetrahydro-1H-benzo[7,8]cycloocta[1,2-c]pyrazole-3-carboxamide | CHEMBL518598
TypeSmall organic molecule
Emp. Form.C25H25Cl3N4O
Mol. Mass.503.851
SMILESClc1ccc(c(Cl)c1)-n1nc(C(=O)NN2CCCCC2)c2CCCCc3cc(Cl)ccc3-c12