Reaction Details
TargetCannabinoid receptor 1
LigandBDBM50176983
Substrate/Competitorn/a
Meas. Tech.ChEMBL_552830 (CHEMBL958035)
Ki 15±n/a nM
Citation Zhang, YBurgess, JPBrackeen, MGilliam, AMascarella, SWPage, KSeltzman, HHThomas, BF Conformationally constrained analogues of N-(piperidinyl)-5-(4-chlorophenyl)-1-(2,4- dichlorophenyl)-4-methyl-1H-pyrazole-3-carboxamide (SR141716): design, synthesis, computational analysis, and biological evaluations. J Med Chem51:3526-39 (2008) 
 
Cannabinoid receptor 1
Name:Cannabinoid receptor 1
Type:G Protein-Coupled Receptor (GPCR)
Mol. Mass.:52868.96
Organism:Homo sapiens (Human)
Description:P21554
Residue:472
BDBM50176983
NameBDBM50176983
Synonyms:7-chloro-1-(2,4-dichlorophenyl)-N-(piperidin-1-yl)-4,5-dihydro-1H-benzo[g]indazole-3-carboxamide | CHEMBL389203
TypeSmall organic molecule
Emp. Form.C23H21Cl3N4O
Mol. Mass.475.798
SMILESClc1ccc(c(Cl)c1)-n1nc(C(=O)NN2CCCCC2)c2CCc3cc(Cl)ccc3-c12