Reaction Details
TargetCannabinoid receptor 1
LigandBDBM50271285
Substrate/Competitorn/a
Meas. Tech.ChEMBL_552826 (CHEMBL957297)
Ki 34.2±n/a nM
Citation Zhang, YBurgess, JPBrackeen, MGilliam, AMascarella, SWPage, KSeltzman, HHThomas, BF Conformationally constrained analogues of N-(piperidinyl)-5-(4-chlorophenyl)-1-(2,4- dichlorophenyl)-4-methyl-1H-pyrazole-3-carboxamide (SR141716): design, synthesis, computational analysis, and biological evaluations. J Med Chem51:3526-39 (2008) 
 
Cannabinoid receptor 1
Name:Cannabinoid receptor 1
Type:G Protein-Coupled Receptor (GPCR)
Mol. Mass.:52868.96
Organism:Homo sapiens (Human)
Description:P21554
Residue:472
BDBM50271285
NameBDBM50271285
Synonyms:1,5-bis(2,4-Dichlorophenyl)-4-methyl-N-piperidin-1-yl-1Hpyrazole-3-carboxamide | CHEMBL484504
TypeSmall organic molecule
Emp. Form.C22H20Cl4N4O
Mol. Mass.498.232
SMILESCc1c(nn(c1-c1ccc(Cl)cc1Cl)-c1ccc(Cl)cc1Cl)C(=O)NN1CCCCC1