Reaction Details
TargetCannabinoid receptor 1
LigandBDBM50271286
Substrate/Competitorn/a
Meas. Tech.ChEMBL_552826 (CHEMBL957297)
Ki 261±n/a nM
Citation Zhang, YBurgess, JPBrackeen, MGilliam, AMascarella, SWPage, KSeltzman, HHThomas, BF Conformationally constrained analogues of N-(piperidinyl)-5-(4-chlorophenyl)-1-(2,4- dichlorophenyl)-4-methyl-1H-pyrazole-3-carboxamide (SR141716): design, synthesis, computational analysis, and biological evaluations. J Med Chem51:3526-39 (2008) 
 
Cannabinoid receptor 1
Name:Cannabinoid receptor 1
Type:G Protein-Coupled Receptor (GPCR)
Mol. Mass.:52868.96
Organism:Homo sapiens (Human)
Description:P21554
Residue:472
BDBM50271286
NameBDBM50271286
Synonyms:5-(2,4-Dichlorophenyl)-4-methyl-N-piperidin-1-yl-1-(2,4,6-trichlorophenyl)-1H-pyrazole-3-carboxamide | CHEMBL519011
TypeSmall organic molecule
Emp. Form.C22H19Cl5N4O
Mol. Mass.532.677
SMILESCc1c(nn(c1-c1ccc(Cl)cc1Cl)-c1c(Cl)cc(Cl)cc1Cl)C(=O)NN1CCCCC1