Reaction Details
TargetCannabinoid receptor 2
LigandBDBM50244178
Substrate/Competitorn/a
Meas. Tech.ChEMBL_554819 (CHEMBL953972)
Ki 5±n/a nM
Citation Pagé, DBalaux, EBoisvert, LLiu, ZMilburn, CTremblay, MWei, ZWoo, SLuo, XCheng, YXYang, HSrivastava, SZhou, FBrown, WTomaszewski, MWalpole, CHodzic, LSt-Onge, SGodbout, CSalois, DPayza, KPayza, K Novel benzimidazole derivatives as selective CB2 agonists. Bioorg Med Chem Lett18:3695-700 (2008) 
 
Cannabinoid receptor 2
Name:Cannabinoid receptor 2
Type:G Protein-Coupled Receptor (GPCR)
Mol. Mass.:39690.94
Organism:Homo sapiens (Human)
Description:P34972
Residue:360
BDBM50244178
NameBDBM50244178
Synonyms:CHEMBL518206 | N-(2-(4-ethoxybenzyl)-1-(cyclopropylmethyl)-1H-benzo[d]imidazol-5-yl)-N-methylthiophene-2-carboxamide
TypeSmall organic molecule
Emp. Form.C26H27N3O2S
Mol. Mass.445.576
SMILESCCOc1ccc(Cc2nc3cc(ccc3n2CC2CC2)N(C)C(=O)c2cccs2)cc1