Reaction Details
TargetCannabinoid receptor 2
LigandBDBM50243747
Substrate/Competitorn/a
Meas. Tech.ChEMBL_554819 (CHEMBL953972)
Ki 2920±n/a nM
Citation Pagé, DBalaux, EBoisvert, LLiu, ZMilburn, CTremblay, MWei, ZWoo, SLuo, XCheng, YXYang, HSrivastava, SZhou, FBrown, WTomaszewski, MWalpole, CHodzic, LSt-Onge, SGodbout, CSalois, DPayza, KPayza, K Novel benzimidazole derivatives as selective CB2 agonists. Bioorg Med Chem Lett18:3695-700 (2008) 
 
Cannabinoid receptor 2
Name:Cannabinoid receptor 2
Type:G Protein-Coupled Receptor (GPCR)
Mol. Mass.:39690.94
Organism:Homo sapiens (Human)
Description:P34972
Residue:360
BDBM50243747
NameBDBM50243747
Synonyms:2-(4-ethoxybenzyl)-N,N-diethyl-1-(piperidin-4-ylmethyl)-1H-benzo[d]imidazole-5-carboxamide | CHEMBL469693
TypeSmall organic molecule
Emp. Form.C27H36N4O2
Mol. Mass.448.6003
SMILESCCOc1ccc(Cc2nc3cc(ccc3n2CC2CCNCC2)C(=O)N(CC)CC)cc1