Reaction Details
TargetCannabinoid receptor 2
LigandBDBM50244352
Substrate/Competitorn/a
Meas. Tech.ChEMBL_554819 (CHEMBL953972)
Ki 39±n/a nM
Citation Pagé, DBalaux, EBoisvert, LLiu, ZMilburn, CTremblay, MWei, ZWoo, SLuo, XCheng, YXYang, HSrivastava, SZhou, FBrown, WTomaszewski, MWalpole, CHodzic, LSt-Onge, SGodbout, CSalois, DPayza, KPayza, K Novel benzimidazole derivatives as selective CB2 agonists. Bioorg Med Chem Lett18:3695-700 (2008) 
 
Cannabinoid receptor 2
Name:Cannabinoid receptor 2
Type:G Protein-Coupled Receptor (GPCR)
Mol. Mass.:39690.94
Organism:Homo sapiens (Human)
Description:P34972
Residue:360
BDBM50244352
NameBDBM50244352
Synonyms:2-(4-ethoxybenzyl)-N,N-diethyl-1-(pyridin-2-ylmethyl)-1H-benzo[d]imidazole-5-carboxamide | CHEMBL472165
TypeSmall organic molecule
Emp. Form.C27H30N4O2
Mol. Mass.442.5527
SMILESCCOc1ccc(Cc2nc3cc(ccc3n2Cc2ccccn2)C(=O)N(CC)CC)cc1