Reaction Details
TargetCannabinoid receptor 1
LigandBDBM50244353
Substrate/Competitorn/a
Meas. Tech.ChEMBL_554820 (CHEMBL953973)
Ki>5000±n/a nM
Citation Pagé, DBalaux, EBoisvert, LLiu, ZMilburn, CTremblay, MWei, ZWoo, SLuo, XCheng, YXYang, HSrivastava, SZhou, FBrown, WTomaszewski, MWalpole, CHodzic, LSt-Onge, SGodbout, CSalois, DPayza, KPayza, K Novel benzimidazole derivatives as selective CB2 agonists. Bioorg Med Chem Lett18:3695-700 (2008) 
 
Cannabinoid receptor 1
Name:Cannabinoid receptor 1
Type:G Protein-Coupled Receptor (GPCR)
Mol. Mass.:52868.96
Organism:Homo sapiens (Human)
Description:P21554
Residue:472
BDBM50244353
NameBDBM50244353
Synonyms:2-(4-ethoxybenzyl)-N,N-diethyl-1-(pyridin-4-ylmethyl)-1H-benzo[d]imidazole-5-carboxamide | CHEMBL512906
TypeSmall organic molecule
Emp. Form.C27H30N4O2
Mol. Mass.442.5527
SMILESCCOc1ccc(Cc2nc3cc(ccc3n2Cc2ccncc2)C(=O)N(CC)CC)cc1