Reaction Details
TargetCannabinoid receptor 2
LigandBDBM50244098
Substrate/Competitorn/a
Meas. Tech.ChEMBL_554821 (CHEMBL953974)
EC50 2±n/a nM
Citation Pagé, DBalaux, EBoisvert, LLiu, ZMilburn, CTremblay, MWei, ZWoo, SLuo, XCheng, YXYang, HSrivastava, SZhou, FBrown, WTomaszewski, MWalpole, CHodzic, LSt-Onge, SGodbout, CSalois, DPayza, KPayza, K Novel benzimidazole derivatives as selective CB2 agonists. Bioorg Med Chem Lett18:3695-700 (2008) 
 
Cannabinoid receptor 2
Name:Cannabinoid receptor 2
Type:G Protein-Coupled Receptor (GPCR)
Mol. Mass.:39690.94
Organism:Homo sapiens (Human)
Description:P34972
Residue:360
BDBM50244098
NameBDBM50244098
Synonyms:2-(4-ethoxybenzyl)-1-(cyclopropylmethyl)-N,N-bis(2,2,2-trifluoroethyl)-1H-benzo[d]imidazole-5-carboxamide | CHEMBL510854
TypeSmall organic molecule
Emp. Form.C25H25F6N3O2
Mol. Mass.513.4753
SMILESCCOc1ccc(Cc2nc3cc(ccc3n2CC2CC2)C(=O)N(CC(F)(F)F)CC(F)(F)F)cc1