Reaction Details
TargetCannabinoid receptor 2
LigandBDBM50244096
Substrate/Competitorn/a
Meas. Tech.ChEMBL_554821 (CHEMBL953974)
EC50 3±n/a nM
Citation Pagé, DBalaux, EBoisvert, LLiu, ZMilburn, CTremblay, MWei, ZWoo, SLuo, XCheng, YXYang, HSrivastava, SZhou, FBrown, WTomaszewski, MWalpole, CHodzic, LSt-Onge, SGodbout, CSalois, DPayza, KPayza, K Novel benzimidazole derivatives as selective CB2 agonists. Bioorg Med Chem Lett18:3695-700 (2008) 
 
Cannabinoid receptor 2
Name:Cannabinoid receptor 2
Type:G Protein-Coupled Receptor (GPCR)
Mol. Mass.:39690.94
Organism:Homo sapiens (Human)
Description:P34972
Residue:360
BDBM50244096
NameBDBM50244096
Synonyms:(2-(4-ethoxybenzyl)-1-(cyclopropylmethyl)-1H-benzo[d]imidazol-5-yl)(piperidin-1-yl)methanone | CHEMBL453844
TypeSmall organic molecule
Emp. Form.C26H31N3O2
Mol. Mass.417.5432
SMILESCCOc1ccc(Cc2nc3cc(ccc3n2CC2CC2)C(=O)N2CCCCC2)cc1