Reaction Details
TargetCannabinoid receptor 2
LigandBDBM50243708
Substrate/Competitorn/a
Meas. Tech.ChEMBL_554821 (CHEMBL953974)
EC50 8.3±n/a nM
Citation Pagé, DBalaux, EBoisvert, LLiu, ZMilburn, CTremblay, MWei, ZWoo, SLuo, XCheng, YXYang, HSrivastava, SZhou, FBrown, WTomaszewski, MWalpole, CHodzic, LSt-Onge, SGodbout, CSalois, DPayza, KPayza, K Novel benzimidazole derivatives as selective CB2 agonists. Bioorg Med Chem Lett18:3695-700 (2008) 
 
Cannabinoid receptor 2
Name:Cannabinoid receptor 2
Type:G Protein-Coupled Receptor (GPCR)
Mol. Mass.:39690.94
Organism:Homo sapiens (Human)
Description:P34972
Residue:360
BDBM50243708
NameBDBM50243708
Synonyms:(R)-2-(4-ethoxybenzyl)-N,N-diethyl-1-((tetrahydrofuran-2-yl)methyl)-1H-benzo[d]imidazole-5-carboxamide | CHEMBL512886
TypeSmall organic molecule
Emp. Form.C26H33N3O3
Mol. Mass.435.5585
SMILESCCOc1ccc(Cc2nc3cc(ccc3n2C[C@H]2CCCO2)C(=O)N(CC)CC)cc1