Reaction Details
TargetCannabinoid receptor 2
LigandBDBM50244215
Substrate/Competitorn/a
Meas. Tech.ChEMBL_554819 (CHEMBL953972)
Ki 36±n/a nM
Citation Pagé, DBalaux, EBoisvert, LLiu, ZMilburn, CTremblay, MWei, ZWoo, SLuo, XCheng, YXYang, HSrivastava, SZhou, FBrown, WTomaszewski, MWalpole, CHodzic, LSt-Onge, SGodbout, CSalois, DPayza, KPayza, K Novel benzimidazole derivatives as selective CB2 agonists. Bioorg Med Chem Lett18:3695-700 (2008) 
 
Cannabinoid receptor 2
Name:Cannabinoid receptor 2
Type:G Protein-Coupled Receptor (GPCR)
Mol. Mass.:39690.94
Organism:Homo sapiens (Human)
Description:P34972
Residue:360
BDBM50244215
NameBDBM50244215
Synonyms:2-(4-ethoxybenzyl)-1-(2-(dimethylamino)ethyl)-N,N-diethyl-1H-benzo[d]imidazole-5-carboxamide | CHEMBL458143
TypeSmall organic molecule
Emp. Form.C25H34N4O2
Mol. Mass.422.5631
SMILESCCOc1ccc(Cc2nc3cc(ccc3n2CCN(C)C)C(=O)N(CC)CC)cc1