Reaction Details
TargetCannabinoid receptor 2
LigandBDBM50243705
Substrate/Competitorn/a
Meas. Tech.ChEMBL_554821 (CHEMBL953974)
EC50 3.3±n/a nM
Citation Pagé, DBalaux, EBoisvert, LLiu, ZMilburn, CTremblay, MWei, ZWoo, SLuo, XCheng, YXYang, HSrivastava, SZhou, FBrown, WTomaszewski, MWalpole, CHodzic, LSt-Onge, SGodbout, CSalois, DPayza, KPayza, K Novel benzimidazole derivatives as selective CB2 agonists. Bioorg Med Chem Lett18:3695-700 (2008) 
 
Cannabinoid receptor 2
Name:Cannabinoid receptor 2
Type:G Protein-Coupled Receptor (GPCR)
Mol. Mass.:39690.94
Organism:Homo sapiens (Human)
Description:P34972
Residue:360
BDBM50243705
NameBDBM50243705
Synonyms:2-(4-ethoxybenzyl)-N,N-diethyl-1-(furan-2-ylmethyl)-1H-benzo[d]imidazole-5-carboxamide | CHEMBL472121
TypeSmall organic molecule
Emp. Form.C26H29N3O3
Mol. Mass.431.5268
SMILESCCOc1ccc(Cc2nc3cc(ccc3n2Cc2ccco2)C(=O)N(CC)CC)cc1