Reaction Details
TargetCannabinoid receptor 2
LigandBDBM50244319
Substrate/Competitorn/a
Meas. Tech.ChEMBL_554821 (CHEMBL953974)
EC50 1.3±n/a nM
Citation Pagé, DBalaux, EBoisvert, LLiu, ZMilburn, CTremblay, MWei, ZWoo, SLuo, XCheng, YXYang, HSrivastava, SZhou, FBrown, WTomaszewski, MWalpole, CHodzic, LSt-Onge, SGodbout, CSalois, DPayza, KPayza, K Novel benzimidazole derivatives as selective CB2 agonists. Bioorg Med Chem Lett18:3695-700 (2008) 
 
Cannabinoid receptor 2
Name:Cannabinoid receptor 2
Type:G Protein-Coupled Receptor (GPCR)
Mol. Mass.:39690.94
Organism:Homo sapiens (Human)
Description:P34972
Residue:360
BDBM50244319
NameBDBM50244319
Synonyms:1-adamantan-1-ylmethyl-2-(4-ethoxy-benzyl)-1H-benzoimidazole-5-carboxylic acid diethylamide | CHEMBL511134
TypeSmall organic molecule
Emp. Form.C32H41N3O2
Mol. Mass.499.6868
SMILESCCOc1ccc(Cc2nc3cc(ccc3n2CC23CC4CC(CC(C4)C2)C3)C(=O)N(CC)CC)cc1