Reaction Details
TargetKappa-type opioid receptor
LigandBDBM50239135
Substrate/Competitorn/a
Meas. Tech.ChEMBL_555222 (CHEMBL965359)
EC50 6300±n/a nM
Citation McAtee, JJDodson, JWDowdell, SEErhard, KGirard, GRGoodman, KBHilfiker, MAJin, JSehon, CASha, DShi, DWang, FWang, GZWang, NWang, YViet, AQYuan, CCZhang, DAiyar, NVBehm, DJCarballo, LHEvans, CAFries, HENagilla, RRoethke, TJXu, XDouglas, SANeeb, MJ Potent and selective small-molecule human urotensin-II antagonists with improved pharmacokinetic profiles. Bioorg Med Chem Lett18:3716-9 (2008) 
 
Kappa-type opioid receptor
Name:Kappa-type opioid receptor
Type:G Protein-Coupled Receptor (GPCR)
Mol. Mass.:42648.76
Organism:Homo sapiens (Human)
Description:P41145
Residue:380
BDBM50239135
NameBDBM50239135
Synonyms:2-((3,4-dichlorophenyl)(methyl)amino)-1-((2R,3R)-3-phenyl-2-(pyrrolidin-1-ylmethyl)piperidin-1-yl)ethanone | CHEMBL402303
TypeSmall organic molecule
Emp. Form.C25H31Cl2N3O
Mol. Mass.460.439
SMILESCN(CC(=O)N1CCC[C@@H]([C@@H]1CN1CCCC1)c1ccccc1)c1ccc(Cl)c(Cl)c1