Reaction Details
TargetCytochrome P450 2D6
LigandBDBM50240153
Substrate/Competitorn/a
Meas. Tech.ChEMBL_555224 (CHEMBL965361)
IC50 750±n/a nM
Citation McAtee, JJDodson, JWDowdell, SEErhard, KGirard, GRGoodman, KBHilfiker, MAJin, JSehon, CASha, DShi, DWang, FWang, GZWang, NWang, YViet, AQYuan, CCZhang, DAiyar, NVBehm, DJCarballo, LHEvans, CAFries, HENagilla, RRoethke, TJXu, XDouglas, SANeeb, MJ Potent and selective small-molecule human urotensin-II antagonists with improved pharmacokinetic profiles. Bioorg Med Chem Lett18:3716-9 (2008) 
 
Cytochrome P450 2D6
Name:Cytochrome P450 2D6
Type:Protein
Mol. Mass.:55774.82
Organism:Homo sapiens (Human)
Description:P10635
Residue:497
BDBM50240153
NameBDBM50240153
Synonyms:(+/-)-2-((3,4-dichlorophenyl)(methyl)amino)-1-(3-phenyl-2-(pyrrolidin-1-ylmethyl)piperidin-1-yl)ethanone rac-2-((3,4-dichlorophenyl)(methyl)amino)-1-(3-phenyl-2-(pyrrolidin-1-ylmethyl)piperidin-1-yl)ethanone
TypeSmall organic molecule
Emp. Form.C25H31Cl2N3O
Mol. Mass.460.439
SMILESCN(CC(=O)N1CCCC(C1CN1CCCC1)c1ccccc1)c1ccc(Cl)c(Cl)c1