Reaction Details
TargetCytochrome P450 3A4
LigandBDBM50240153
Substrate/Competitorn/a
Meas. Tech.ChEMBL_555225 (CHEMBL965362)
IC50 1400±n/a nM
Citation McAtee, JJDodson, JWDowdell, SEErhard, KGirard, GRGoodman, KBHilfiker, MAJin, JSehon, CASha, DShi, DWang, FWang, GZWang, NWang, YViet, AQYuan, CCZhang, DAiyar, NVBehm, DJCarballo, LHEvans, CAFries, HENagilla, RRoethke, TJXu, XDouglas, SANeeb, MJ Potent and selective small-molecule human urotensin-II antagonists with improved pharmacokinetic profiles. Bioorg Med Chem Lett18:3716-9 (2008) 
 
Cytochrome P450 3A4
Name:Cytochrome P450 3A4
Type:Enzyme
Mol. Mass.:57349.57
Organism:Homo sapiens (Human)
Description:n/a
Residue:503
BDBM50240153
NameBDBM50240153
Synonyms:(+/-)-2-((3,4-dichlorophenyl)(methyl)amino)-1-(3-phenyl-2-(pyrrolidin-1-ylmethyl)piperidin-1-yl)ethanone rac-2-((3,4-dichlorophenyl)(methyl)amino)-1-(3-phenyl-2-(pyrrolidin-1-ylmethyl)piperidin-1-yl)ethanone
TypeSmall organic molecule
Emp. Form.C25H31Cl2N3O
Mol. Mass.460.439
SMILESCN(CC(=O)N1CCCC(C1CN1CCCC1)c1ccccc1)c1ccc(Cl)c(Cl)c1