Reaction Details
TargetKappa-type opioid receptor
LigandBDBM50244017
Substrate/Competitorn/a
Meas. Tech.ChEMBL_555222 (CHEMBL965359)
EC50 40±n/a nM
Citation McAtee, JJDodson, JWDowdell, SEErhard, KGirard, GRGoodman, KBHilfiker, MAJin, JSehon, CASha, DShi, DWang, FWang, GZWang, NWang, YViet, AQYuan, CCZhang, DAiyar, NVBehm, DJCarballo, LHEvans, CAFries, HENagilla, RRoethke, TJXu, XDouglas, SANeeb, MJ Potent and selective small-molecule human urotensin-II antagonists with improved pharmacokinetic profiles. Bioorg Med Chem Lett18:3716-9 (2008) 
 
Kappa-type opioid receptor
Name:Kappa-type opioid receptor
Type:G Protein-Coupled Receptor (GPCR)
Mol. Mass.:42648.76
Organism:Homo sapiens (Human)
Description:P41145
Residue:380
BDBM50244017
NameBDBM50244017
Synonyms:CHEMBL452808 | N-((S)-1-Biphenyl-4-yl-2-morpholin-4-yl-ethyl)-2-(6,7-dichloro-3-oxo-2,3-dihydro-benzo[1,4]oxazin-4-yl)-N-methyl-acetamide
TypeSmall organic molecule
Emp. Form.C29H29Cl2N3O4
Mol. Mass.554.464
SMILESCN([C@H](CN1CCOCC1)c1ccc(cc1)-c1ccccc1)C(=O)CN1C(=O)COc2cc(Cl)c(Cl)cc12