Reaction Details
TargetUrotensin-2 receptor
LigandBDBM50244018
Substrate/Competitorn/a
Meas. Tech.ChEMBL_555221 (CHEMBL965358)
Ki 6±n/a nM
Citation McAtee, JJDodson, JWDowdell, SEErhard, KGirard, GRGoodman, KBHilfiker, MAJin, JSehon, CASha, DShi, DWang, FWang, GZWang, NWang, YViet, AQYuan, CCZhang, DAiyar, NVBehm, DJCarballo, LHEvans, CAFries, HENagilla, RRoethke, TJXu, XDouglas, SANeeb, MJ Potent and selective small-molecule human urotensin-II antagonists with improved pharmacokinetic profiles. Bioorg Med Chem Lett18:3716-9 (2008) 
 
Urotensin-2 receptor
Name:Urotensin-2 receptor
Type:Enzyme Catalytic Domain
Mol. Mass.:42159.71
Organism:Homo sapiens (Human)
Description:Urotensin-II UTS2R HUMAN::Q9UKP6
Residue:389
BDBM50244018
NameBDBM50244018
Synonyms:4'-(1-{[2-(6,7-Dimethyl-2-oxo-2H-quinoxalin-1-yl)-acetyl]-methyl-amino}-2-morpholin-4-yl-ethyl)-biphenyl-3-carboxylic acid methylamide | CHEMBL499582
TypeSmall organic molecule
Emp. Form.C33H37N5O4
Mol. Mass.567.678
SMILESCNC(=O)c1cccc(c1)-c1ccc(cc1)C(CN1CCOCC1)N(C)C(=O)Cn1c2cc(C)c(C)cc2ncc1=O