Reaction Details
TargetCytochrome P450 2D6
LigandBDBM50243971
Substrate/Competitorn/a
Meas. Tech.ChEMBL_555224 (CHEMBL965361)
IC50 33000±n/a nM
Citation McAtee, JJDodson, JWDowdell, SEErhard, KGirard, GRGoodman, KBHilfiker, MAJin, JSehon, CASha, DShi, DWang, FWang, GZWang, NWang, YViet, AQYuan, CCZhang, DAiyar, NVBehm, DJCarballo, LHEvans, CAFries, HENagilla, RRoethke, TJXu, XDouglas, SANeeb, MJ Potent and selective small-molecule human urotensin-II antagonists with improved pharmacokinetic profiles. Bioorg Med Chem Lett18:3716-9 (2008) 
 
Cytochrome P450 2D6
Name:Cytochrome P450 2D6
Type:Protein
Mol. Mass.:55774.82
Organism:Homo sapiens (Human)
Description:P10635
Residue:497
BDBM50243971
NameBDBM50243971
Synonyms:CHEMBL453075 | N-((R)-1-Biphenyl-4-yl-2-morpholin-4-yl-ethyl)-2-(6,7-dichloro-3-oxo-2,3-dihydro-benzo[1,4]oxazin-4-yl)-N-methyl-acetamide
TypeSmall organic molecule
Emp. Form.C29H29Cl2N3O4
Mol. Mass.554.464
SMILESCN([C@@H](CN1CCOCC1)c1ccc(cc1)-c1ccccc1)C(=O)CN1C(=O)COc2cc(Cl)c(Cl)cc12