Reaction Details
TargetCytochrome P450 3A4
LigandBDBM50244021
Substrate/Competitorn/a
Meas. Tech.ChEMBL_555225 (CHEMBL965362)
IC50 5000±n/a nM
Citation McAtee, JJDodson, JWDowdell, SEErhard, KGirard, GRGoodman, KBHilfiker, MAJin, JSehon, CASha, DShi, DWang, FWang, GZWang, NWang, YViet, AQYuan, CCZhang, DAiyar, NVBehm, DJCarballo, LHEvans, CAFries, HENagilla, RRoethke, TJXu, XDouglas, SANeeb, MJ Potent and selective small-molecule human urotensin-II antagonists with improved pharmacokinetic profiles. Bioorg Med Chem Lett18:3716-9 (2008) 
 
Cytochrome P450 3A4
Name:Cytochrome P450 3A4
Type:Enzyme
Mol. Mass.:57349.57
Organism:Homo sapiens (Human)
Description:n/a
Residue:503
BDBM50244021
NameBDBM50244021
Synonyms:4'-(1-{[2-(6,7-Dichloro-2-oxo-2H-quinoxalin-1-yl)-acetyl]-methyl-amino}-2-morpholin-4-yl-ethyl)-biphenyl-3-carboxylic acid methylamide | CHEMBL507691
TypeSmall organic molecule
Emp. Form.C31H31Cl2N5O4
Mol. Mass.608.515
SMILESCNC(=O)c1cccc(c1)-c1ccc(cc1)C(CN1CCOCC1)N(C)C(=O)Cn1c2cc(Cl)c(Cl)cc2ncc1=O