Reaction Details
TargetCytochrome P450 3A4
LigandBDBM50244020
Substrate/Competitorn/a
Meas. Tech.ChEMBL_555225 (CHEMBL965362)
IC50 2200±n/a nM
Citation McAtee, JJDodson, JWDowdell, SEErhard, KGirard, GRGoodman, KBHilfiker, MAJin, JSehon, CASha, DShi, DWang, FWang, GZWang, NWang, YViet, AQYuan, CCZhang, DAiyar, NVBehm, DJCarballo, LHEvans, CAFries, HENagilla, RRoethke, TJXu, XDouglas, SANeeb, MJ Potent and selective small-molecule human urotensin-II antagonists with improved pharmacokinetic profiles. Bioorg Med Chem Lett18:3716-9 (2008) 
 
Cytochrome P450 3A4
Name:Cytochrome P450 3A4
Type:Enzyme
Mol. Mass.:57349.57
Organism:Homo sapiens (Human)
Description:n/a
Residue:503
BDBM50244020
NameBDBM50244020
Synonyms:4'-[1-({2-[Cyanomethyl-(3,4-dichloro-phenyl)-amino]-acetyl}-methyl-amino)-2-pyrrolidin-1-yl-ethyl]-biphenyl-3-carboxylic acid amide | CHEMBL453587
TypeSmall organic molecule
Emp. Form.C30H31Cl2N5O2
Mol. Mass.564.505
SMILESCN(C(CN1CCCC1)c1ccc(cc1)-c1cccc(c1)C(N)=O)C(=O)CN(CC#N)c1ccc(Cl)c(Cl)c1