Reaction Details
TargetCytochrome P450 3A4
LigandBDBM50244019
Substrate/Competitorn/a
Meas. Tech.ChEMBL_555225 (CHEMBL965362)
IC50 2600±n/a nM
Citation McAtee, JJDodson, JWDowdell, SEErhard, KGirard, GRGoodman, KBHilfiker, MAJin, JSehon, CASha, DShi, DWang, FWang, GZWang, NWang, YViet, AQYuan, CCZhang, DAiyar, NVBehm, DJCarballo, LHEvans, CAFries, HENagilla, RRoethke, TJXu, XDouglas, SANeeb, MJ Potent and selective small-molecule human urotensin-II antagonists with improved pharmacokinetic profiles. Bioorg Med Chem Lett18:3716-9 (2008) 
 
Cytochrome P450 3A4
Name:Cytochrome P450 3A4
Type:Enzyme
Mol. Mass.:57349.57
Organism:Homo sapiens (Human)
Description:n/a
Residue:503
BDBM50244019
NameBDBM50244019
Synonyms:4'-[1-({2-[(3,4-Dichloro-phenyl)-(2-methoxy-ethyl)-amino]-acetyl}-methyl-amino)-2-pyrrolidin-1-yl-ethyl]-biphenyl-4-carboxylic acid amide | CHEMBL453067
TypeSmall organic molecule
Emp. Form.C31H36Cl2N4O3
Mol. Mass.583.549
SMILESCOCCN(CC(=O)N(C)C(CN1CCCC1)c1ccc(cc1)-c1ccc(cc1)C(N)=O)c1ccc(Cl)c(Cl)c1