Reaction Details
TargetCytochrome P450 3A4
LigandBDBM50243921
Substrate/Competitorn/a
Meas. Tech.ChEMBL_555225 (CHEMBL965362)
IC50 4900±n/a nM
Citation McAtee, JJDodson, JWDowdell, SEErhard, KGirard, GRGoodman, KBHilfiker, MAJin, JSehon, CASha, DShi, DWang, FWang, GZWang, NWang, YViet, AQYuan, CCZhang, DAiyar, NVBehm, DJCarballo, LHEvans, CAFries, HENagilla, RRoethke, TJXu, XDouglas, SANeeb, MJ Potent and selective small-molecule human urotensin-II antagonists with improved pharmacokinetic profiles. Bioorg Med Chem Lett18:3716-9 (2008) 
 
Cytochrome P450 3A4
Name:Cytochrome P450 3A4
Type:Enzyme
Mol. Mass.:57349.57
Organism:Homo sapiens (Human)
Description:n/a
Residue:503
BDBM50243921
NameBDBM50243921
Synonyms:CHEMBL488642 | N-(1-Biphenyl-4-yl-2-pyrrolidin-1-yl-ethyl)-2-[(3,4-dichloro-phenyl)-methyl-amino]-N-methyl-acetamide
TypeSmall organic molecule
Emp. Form.C28H31Cl2N3O
Mol. Mass.496.471
SMILESCN(CC(=O)N(C)C(CN1CCCC1)c1ccc(cc1)-c1ccccc1)c1ccc(Cl)c(Cl)c1