Reaction Details
TargetCannabinoid receptor 2
LigandBDBM50244359
Substrate/Competitorn/a
Meas. Tech.ChEMBL_554591 (CHEMBL964505)
Ki 0.54±n/a nM
Citation Krishnamurthy, MGurley, SMoore, BM Exploring the substituent effects on a novel series of C1'-dimethyl-aryl Delta8-tetrahydrocannabinol analogs. Bioorg Med Chem16:6489-500 (2008) 
 
Cannabinoid receptor 2
Name:Cannabinoid receptor 2
Type:G Protein-Coupled Receptor (GPCR)
Mol. Mass.:39690.94
Organism:Homo sapiens (Human)
Description:P34972
Residue:360
BDBM50244359
NameBDBM50244359
Synonyms:(6aR,10aR)-3-(2-(3-bromophenyl)propan-2-yl)-6,6,9-trimethyl-6a,7,10,10a-tetrahydro-6H-benzo[c]chromen-1-ol CHEMBL487464
TypeSmall organic molecule
Emp. Form.C25H29BrO2
Mol. Mass.441.401
SMILESCC1=CC[C@@H]2[C@@H](C1)c1c(O)cc(cc1OC2(C)C)C(C)(C)c1cccc(Br)c1