Reaction Details
TargetVascular endothelial growth factor receptor 3
LigandBDBM50243881
Substrate/Competitorn/a
Meas. Tech.ChEMBL_555003 (CHEMBL957978)
IC50 3200±n/a nM
Citation Peifer, CSelig, RKinkel, KOtt, DTotzke, FSchächtele, CHeidenreich, RRöcken, MSchollmeyer, DLaufer, S Design, synthesis, and biological evaluation of novel 3-aryl-4-(1H-indole-3yl)-1,5-dihydro-2H-pyrrole-2-ones as vascular endothelial growth factor receptor (VEGF-R) inhibitors. J Med Chem51:3814-24 (2008) 
 
Vascular endothelial growth factor receptor 3
Name:Vascular endothelial growth factor receptor 3
Type:Protein
Mol. Mass.:152749.58
Organism:Homo sapiens (Human)
Description:P35916-2
Residue:1363
BDBM50243881
NameBDBM50243881
Synonyms:4-[1-(Methoxymethyl)-1H-indol-3-yl]-3-(3,4,5-trimethoxyphenyl)-1,5-dihydro-2H-pyrrole-2-one | CHEMBL519590
TypeSmall organic molecule
Emp. Form.C23H24N2O5
Mol. Mass.408.4471
SMILESCOCn1cc(C2=C(C(=O)NC2)c2cc(OC)c(OC)c(OC)c2)c2ccccc12