Reaction Details
TargetReceptor tyrosine-protein kinase erbB-2
LigandBDBM47167
Substrate/Competitorn/a
Meas. Tech.ChEMBL_554999 (CHEMBL957974)
IC50 26000±n/a nM
Citation Peifer, CSelig, RKinkel, KOtt, DTotzke, FSchächtele, CHeidenreich, RRöcken, MSchollmeyer, DLaufer, S Design, synthesis, and biological evaluation of novel 3-aryl-4-(1H-indole-3yl)-1,5-dihydro-2H-pyrrole-2-ones as vascular endothelial growth factor receptor (VEGF-R) inhibitors. J Med Chem51:3814-24 (2008) 
 
Receptor tyrosine-protein kinase erbB-2
Name:Receptor tyrosine-protein kinase erbB-2
Type:n/a
Mol. Mass.:137894.47
Organism:Homo sapiens (Human)
Description:P04626
Residue:1255
BDBM47167
NameBDBM47167
Synonyms:CHEMBL201511 US9364459, A
Typen/a
Emp. Form.C21H18N2O5
Mol. Mass.378.378
SMILESCOc1cc(cc(OC)c1OC)C1=C(C(=O)NC1=O)c1c[nH]c2ccccc12