Reaction Details
TargetFocal adhesion kinase 1
LigandBDBM50243761
Substrate/Competitorn/a
Meas. Tech.ChEMBL_555000 (CHEMBL957975)
IC50 9500±n/a nM
Citation Peifer, CSelig, RKinkel, KOtt, DTotzke, FSchächtele, CHeidenreich, RRöcken, MSchollmeyer, DLaufer, S Design, synthesis, and biological evaluation of novel 3-aryl-4-(1H-indole-3yl)-1,5-dihydro-2H-pyrrole-2-ones as vascular endothelial growth factor receptor (VEGF-R) inhibitors. J Med Chem51:3814-24 (2008) 
 
Focal adhesion kinase 1
Name:Focal adhesion kinase 1
Type:Tyrosine-protein kinase
Mol. Mass.:119233.17
Organism:Homo sapiens (Human)
Description:Q05397
Residue:1052
BDBM50243761
NameBDBM50243761
Synonyms:4-(1H-Indol-3-yl)-3-(3,4,5-trimethoxyphenyl)-1,5-dihydro-2H-pyrrole-2-one | CHEMBL529663
TypeSmall organic molecule
Emp. Form.C21H20N2O4
Mol. Mass.364.3945
SMILESCOc1cc(cc(OC)c1OC)C1=C(CNC1=O)c1c[nH]c2ccccc12