Reaction Details
TargetVascular endothelial growth factor receptor 2
LigandBDBM50243879
Substrate/Competitorn/a
Meas. Tech.ChEMBL_555002 (CHEMBL957977)
IC50 5900±n/a nM
Citation Peifer, CSelig, RKinkel, KOtt, DTotzke, FSchächtele, CHeidenreich, RRöcken, MSchollmeyer, DLaufer, S Design, synthesis, and biological evaluation of novel 3-aryl-4-(1H-indole-3yl)-1,5-dihydro-2H-pyrrole-2-ones as vascular endothelial growth factor receptor (VEGF-R) inhibitors. J Med Chem51:3814-24 (2008) 
 
Vascular endothelial growth factor receptor 2
Name:Vascular endothelial growth factor receptor 2
Type:Receptor Tyrosine Kinase
Mol. Mass.:151510.97
Organism:Homo sapiens (Human)
Description:P35968
Residue:1356
BDBM50243879
NameBDBM50243879
Synonyms:5-Hydroxy-4-(1H-indol-3-yl)-3-(3,4,5-trimethoxyphenyl)-1,5-dihydro-2H-pyrrole-2-one | CHEMBL505253
TypeSmall organic molecule
Emp. Form.C21H20N2O5
Mol. Mass.380.3939
SMILESCOc1cc(cc(OC)c1OC)C1=C(C(O)NC1=O)c1c[nH]c2ccccc12